BDBM21692 1-(4-chlorophenyl)-3-[1-methyl-3-oxo-2-phenyl-5-(propan-2-yl)-2,3-dihydro-1H-pyrazol-4-yl]urea::1-(4-chlorophenyl)-3-[1-methyl-5-(1-methylethyl)-3-oxo-2-phenyl-2,3-dihydro-1H-pyrazol-4-yl]urea::CHEMBL379761::Pyrazolone, 1
SMILES CC(C)c1c(NC(=O)Nc2ccc(Cl)cc2)c(=O)n(-c2ccccc2)n1C
InChI Key InChIKey=PAEBEUZTAPIOIO-UHFFFAOYSA-N
Data  6 EC50
PDB links: 1 PDB ID matches this monomer.
  Tab Delimited (TSV)   2D SDfile   Computed 3D by Vconf -m prep SDfile
Find this compound or compounds like it in BindingDB:
Activity Spreadsheet -- Enzyme Inhibition Constant Data from BindingDB
Found 6 hits for monomerid = 21692
TargetN-formyl peptide receptor 2(Homo sapiens (Human))
Amgen
LigandPNGBDBM21692(1-(4-chlorophenyl)-3-[1-methyl-3-oxo-2-phenyl-5-(p...)
Affinity DataEC50:  44nMpH: 7.2 T: 2°C. Assay description: hFPRL 1 activity was assayed using an aequorin-based bioluminescence assay (Ca2+ flux). EC50 values have been determined by Ca2+ flux in CHO recombin...
TargetN-formyl peptide receptor 2(Homo sapiens (Human))
Amgen
LigandPNGBDBM21692(1-(4-chlorophenyl)-3-[1-methyl-3-oxo-2-phenyl-5-(p...)
Affinity DataEC50:  44nM. Assay description: Activity at human FPRL1-mediated calcium mobilization in CHO cells
TargetfMet-Leu-Phe receptor(Homo sapiens (Human))
Monash University
Curated by ChEMBL
LigandPNGBDBM21692(1-(4-chlorophenyl)-3-[1-methyl-3-oxo-2-phenyl-5-(p...)
Affinity DataEC50:  32nM. Assay description: Biased agonist activity at human FPR1 expressed in FlpIn-CHO cells assessed as intracellular calcium mobilization by Fluo-4-AM dye based fluorescence...
In DepthDetails ArticlePubMed
TargetfMet-Leu-Phe receptor(Homo sapiens (Human))
Monash University
Curated by ChEMBL
LigandPNGBDBM21692(1-(4-chlorophenyl)-3-[1-methyl-3-oxo-2-phenyl-5-(p...)
Affinity DataEC50:  51nM. Assay description: Biased agonist activity at human FPR1 expressed in FlpIn-CHO cells assessed as stimulation of ERK1/2 phosphorylation measured after 7 mins by Alphasc...
In DepthDetails ArticlePubMed
TargetN-formyl peptide receptor 2(Homo sapiens (Human))
Amgen
LigandPNGBDBM21692(1-(4-chlorophenyl)-3-[1-methyl-3-oxo-2-phenyl-5-(p...)
Affinity DataEC50:  41nM. Assay description: Biased agonist activity at human FPR2 expressed in FlpIn-CHO cells assessed as stimulation of ERK1/2 phosphorylation measured after 7 mins by Alphasc...
TargetN-formyl peptide receptor 2(Homo sapiens (Human))
Amgen
LigandPNGBDBM21692(1-(4-chlorophenyl)-3-[1-methyl-3-oxo-2-phenyl-5-(p...)
Affinity DataEC50:  95nM. Assay description: Biased agonist activity at human FPR2 expressed in FlpIn-CHO cells assessed as intracellular calcium mobilization by Fluo-4-AM dye based fluorescence...