BDBM217006 US9302989, 1465
SMILES CCC(C)NC(=O)C1CCN(CC1)c1ccc(NC(=O)N2Cc3ccncc3C2)cc1
InChI Key InChIKey=XZXBYKYSFJYHKH-UHFFFAOYSA-N
Data  1 IC50
  Tab Delimited (TSV)   2D SDfile   Computed 3D by Vconf -m prep SDfile
Find this compound or compounds like it in BindingDB:
Activity Spreadsheet -- Enzyme Inhibition Constant Data from BindingDB
Found 1 hit for monomerid = 217006
TargetNicotinamide phosphoribosyltransferase(Homo sapiens (Human))
Abbvie
US Patent
LigandPNGBDBM217006(US9302989, 1465)
Affinity DataIC50:  101nMpH: 7.5Assay Description:Probe 2:The assay was carried out in 18 uL low volume plates (Owens Corning) in reaction buffer (50 mM HEPES (NaOH), pH 7.5, 100 mM NaCl, 10 mM MgCl2...
Ligand InfoPC cidPC sid
In DepthDetails US Patent