BDBM217084 US9302989, 379
SMILES Fc1ccc2CN(Cc2c1)C(=O)Nc1ccc(cc1)-c1n[nH]c(=O)c2ccccc12
InChI Key InChIKey=UXSQCNYVZULXEF-UHFFFAOYSA-N
Data  1 KI  2 IC50
  Tab Delimited (TSV)   2D SDfile   Computed 3D by Vconf -m prep SDfile
Find this compound or compounds like it in BindingDB:
Activity Spreadsheet -- Enzyme Inhibition Constant Data from BindingDB
Found 3 hits for monomerid = 217084
TargetRho-associated protein kinase 2(Homo sapiens (Human))
Abbvie
US Patent
LigandPNGBDBM217084(US9302989, 379)
Affinity DataKi:  2.40nM. Assay description: HTRF assay: This assay used the CisBio HTRF KinEASE kit (kit 62ST2PEZ) and the kinase reaction containing 0.2 uM biotinylated substrate peptide (S2, ...
Ligand InfoPC cidPC sid
In DepthDetails US Patent
TargetNicotinamide phosphoribosyltransferase(Homo sapiens (Human))
Abbvie
US Patent
LigandPNGBDBM217084(US9302989, 379)
Affinity DataIC50:  51.1nMpH: 7.5Assay Description:Probe 1:The assay was carried out in 18 uL low volume plates (Owens Corning) in reaction buffer (50 mM HEPES (NaOH), pH 7.5, 100 mM NaCl, 10 mM MgCl2...
Ligand InfoPC cidPC sid
In DepthDetails US Patent
TargetNicotinamide phosphoribosyltransferase(Homo sapiens (Human))
Abbvie
US Patent
LigandPNGBDBM217084(US9302989, 379)
Affinity DataIC50:  40.4nMpH: 7.5Assay Description:Probe 2:The assay was carried out in 18 uL low volume plates (Owens Corning) in reaction buffer (50 mM HEPES (NaOH), pH 7.5, 100 mM NaCl, 10 mM MgCl2...
Ligand InfoPC cidPC sid
In DepthDetails US Patent