BDBM218021 US9212182, 732
SMILES COc1ccc(F)c(c1)-c1cc(OC)c(cc1F)-n1c2ccc(cc2ccc1=O)S(=O)(=O)Nc1ccon1
InChI Key InChIKey=SAMUBSRXXPLIFD-UHFFFAOYSA-N
Data  1 IC50
  Tab Delimited (TSV)   2D SDfile   Computed 3D by Vconf -m prep SDfile
Find this compound or compounds like it in BindingDB:
Activity Spreadsheet -- Enzyme Inhibition Constant Data from BindingDB
Found 1 hit for monomerid = 218021
TargetSodium channel protein type 9 subunit alpha(Homo sapiens (Human))
Amgen
US Patent
LigandPNGBDBM218021(US9212182, 732)
Affinity DataIC50:  56nM. Assay description: HEK 293 cells stably transfected with human Nav1.7 were recorded in whole cell voltage clamp mode with the PatchXpress automated electrophysiology sy...
Ligand InfoPC cidPC sid
In DepthDetails US Patent