BDBM218130 US9212182, 1225
SMILES COc1nc(Oc2cc(F)ccc2F)c(Cl)cc1-n1c2ccc(cc2ccc1=O)S(=O)(=O)Nc1ccon1
InChI Key InChIKey=PRYPWRYJDWGMQX-UHFFFAOYSA-N
Data  1 IC50
  Tab Delimited (TSV)   2D SDfile   Computed 3D by Vconf -m prep SDfile
Find this compound or compounds like it in BindingDB:
Activity Spreadsheet -- Enzyme Inhibition Constant Data from BindingDB
Found 1 hit for monomerid = 218130
TargetSodium channel protein type 9 subunit alpha(Homo sapiens (Human))
Amgen
US Patent
LigandPNGBDBM218130(US9212182, 1225)
Affinity DataIC50:  846nM. Assay description: HEK 293 cells stably transfected with human Nav1.7 were recorded in whole cell voltage clamp mode with the PatchXpress automated electrophysiology sy...
Ligand InfoPC cidPC sid
In DepthDetails US Patent