BDBM218456 US9284333, 16hp::US9884860, Example 16hp
SMILES CC[C@@H](NC(=O)c1cc(C(=O)N[C@@H](CC)c2ccc(OC)nc2)n2CCOCc12)c1ccccc1
InChI Key InChIKey=HKEPMSLDUUTCJS-YADHBBJMSA-N
Data  2 IC50
  Tab Delimited (TSV)   2D SDfile   Computed 3D by Vconf -m prep SDfile
Find this compound or compounds like it in BindingDB:
Activity Spreadsheet -- Enzyme Inhibition Constant Data from BindingDB
Found 2 hits for monomerid = 218456
TargetPotassium channel subfamily K member 3(Homo sapiens (Human))
Sanofi
US Patent
LigandPNGBDBM218456(US9284333, 16hp | US9884860, Example 16hp)
Affinity DataIC50:  560nMT: 2°C. Assay description: Human TASK-1 channels were expressed in Xenopus oocytes. For this purpose, oocytes were isolated from Xenopus laevis and defoliculated. Subsequently,...
Ligand InfoPC cidPC sid
In DepthDetails US Patent
TargetPotassium channel subfamily K member 3(Homo sapiens (Human))
Sanofi
US Patent
LigandPNGBDBM218456(US9284333, 16hp | US9884860, Example 16hp)
Affinity DataIC50:  560nMT: 2°C. Assay description: Human TASK-1 channels were expressed in Xenopus oocytes. For this purpose, oocytes were isolated from Xenopus laevis and defoliculated. Subsequently,...
Ligand InfoPC cidPC sid
In DepthDetails US Patent