BDBM218810 NTS8-13
SMILES CC[C@H](C)C(NC(=O)[C@H](Cc1ccc(O)cc1)NC(=O)[C@@H]1CCCN1C(=O)[C@H](CCCNC(N)=N)NC(=O)[C@@H](N)CCCNC(N)=N)C(=O)N[C@@H](CC(C)C)C(O)=O
InChI Key InChIKey=DQDBCHHEIKQPJD-MKSGRCCHSA-N
Data  1 Kd
  Tab Delimited (TSV)   2D SDfile   Computed 3D by Vconf -m prep SDfile
Find this compound or compounds like it in BindingDB:
Activity Spreadsheet -- Enzyme Inhibition Constant Data from BindingDB
Found 1 hit for monomerid = 218810
TargetNeurotensin receptor type 1 [45-272,291-390,C386A,C388A](Rattus norvegicus (Rat))
Stockholm University
LigandPNGBDBM218810(NTS8-13)
Affinity DataKd:  43nM. Assay description: The rat NTSR1 variant NTSR1-H4 was first expressed in E. coli using a derivative of the vector pRG/III-hsMBP. This construct had a C-terminally fused...
In DepthDetails ArticlePubMed