BDBM219294 US9303033, M18, Table 33A, Compound 110
SMILES O=C1NC(=O)\C(N1)=C\c1cnn2c(NC3CC3)nc(NN3CCCCC3)nc12
InChI Key InChIKey=RFHPUZLQSOKRTC-WQLSENKSSA-N
Data  2 IC50
  Tab Delimited (TSV)   2D SDfile   Computed 3D by Vconf -m prep SDfile
Find this compound or compounds like it in BindingDB:
Activity Spreadsheet -- Enzyme Inhibition Constant Data from BindingDB
Found 2 hits for monomerid = 219294
TargetCasein kinase II subunit alpha/beta(Homo sapiens (Human))
Senhwa Biosciences
US Patent
LigandPNGBDBM219294(US9303033, M18, Table 33A, Compound 110)
Affinity DataIC50: <100nMpH: 7.2Assay Description:In a final reaction volume of 50 μl, CK2 ααββ (4 ng, 8.5 mU) was incubated with various concentrations of test compounds in ...
Ligand InfoPC cidPC sid
In DepthDetails US Patent
TargetCasein kinase II subunit beta(Homo sapiens (Human))
Senhwa Biosciences
US Patent
LigandPNGBDBM219294(US9303033, M18, Table 33A, Compound 110)
Affinity DataIC50: >2.50E+3nMpH: 7.0Assay Description:5 uM ATP: Test compounds dissolved and diluted in DMSO (2 μl) were added to a reaction mixture comprising 10 μl of 5× Reaction Buffer (40 m...
Ligand InfoPC cidPC sid
In DepthDetails US Patent