BDBM21992 5-{[(3R)-3-hydroxypyrrolidin-1-yl]carbonyl}-3-methyl-1-(2-methylpropyl)-6-(naphthalen-1-yloxy)-1H,2H,3H,4H-thieno[2,3-d]pyrimidine-2,4-dione::Thienopyrimidine-2,4-dione, 7
SMILES CC(C)Cn1c2sc(Oc3cccc4ccccc34)c(C(=O)N3CC[C@@H](O)C3)c2c(=O)n(C)c1=O
InChI Key InChIKey=KGGUBHJOEDSZBC-QGZVFWFLSA-N
Data  1 KI
  Tab Delimited (TSV)   2D SDfile   Computed 3D by Vconf -m prep SDfile
Find this compound or compounds like it in BindingDB:
Activity Spreadsheet -- Enzyme Inhibition Constant Data from BindingDB
Found 1 hit for monomerid = 21992
TargetMonocarboxylate transporter 1(Homo sapiens (Human))
Astrazeneca
LigandPNGBDBM21992(5-{[(3R)-3-hydroxypyrrolidin-1-yl]carbonyl}-3-meth...)
Affinity DataKi:  0.310nM ΔG°:  -12.8kcal/molepH: 7.8 T: 2°C. Assay description: Jurkat cell membranes were incubated with [3H]-labeled ligand in the absence or presence of increasing concentrations of test compound. The reagents ...
Ligand InfoPC cidPC sid
In DepthDetails ArticlePubMed