BDBM220412 US9296741, 1
SMILES Cn1cc(-c2ccccc2Oc2ccccc2)c2cc[nH]c2c1=O
InChI Key InChIKey=NUAFIMXCNWRSMX-UHFFFAOYSA-N
Data  3 KI  1 EC50
PDB links: 1 PDB ID matches this monomer.
  Tab Delimited (TSV)   2D SDfile   Computed 3D by Vconf -m prep SDfile
Find this compound or compounds like it in BindingDB:
Activity Spreadsheet -- Enzyme Inhibition Constant Data from BindingDB
Found 4 hits for monomerid = 220412
TargetBromodomain-containing protein 4 [352-457](Homo sapiens (Human))
Abbvie
US Patent
LigandPNGBDBM220412(US9296741, 1)
Affinity DataKi:  41nM ΔG°:  -10.1kcal/molepH: 6.0 T: 2°C. Assay description: A time-resolved fluorescence resonance energy transfer (TR-FRET) assay was used to determine the affinities of compounds of the Examples listed in Ta...
Ligand InfoPC cidPC sidPDB
TargetBromodomain-containing protein 4(Homo sapiens (Human))
Abbvie
Curated by ChEMBL
LigandPNGBDBM220412(US9296741, 1)
Affinity DataKi:  48nM. Assay description: The compound was tested for the inhibition of fibrinogen receptor
Ligand InfoPC cidPC sidPDB
TargetBromodomain-containing protein 4 [57-168](Homo sapiens (Human))
Abbvie
US Patent
LigandPNGBDBM220412(US9296741, 1)
Affinity DataKi:  136nM ΔG°:  -9.36kcal/molepH: 6.0 T: 2°C. Assay description: A time-resolved fluorescence resonance energy transfer (TR-FRET) assay was used to determine the affinities of compounds of the Examples listed in Ta...
Ligand InfoPC cidPC sidPDB
In DepthDetails US Patent
TargetBromodomain-containing protein 4(Homo sapiens (Human))
Abbvie
Curated by ChEMBL
LigandPNGBDBM220412(US9296741, 1)
Affinity DataEC50:  480nM. Assay description: Inhibition of BRD4 in human H1299 cells assessed as decrease in HPV LCR-E2-EP400-mediated transcriptional repression after 24 hrs by Bright-Glo lucif...
Ligand InfoPC cidPC sidPDB