BDBM220633 US9296741, 222
SMILES CN1CCC[C@H]1COc1ccc(cc1-c1cn(C)c(=O)c2[nH]ccc12)S(C)(=O)=O
InChI Key InChIKey=PLFYIWOUFTWZDE-AWEZNQCLSA-N
Data  2 KI
  Tab Delimited (TSV)   2D SDfile   Computed 3D by Vconf -m prep SDfile
Find this compound or compounds like it in BindingDB:
Activity Spreadsheet -- Enzyme Inhibition Constant Data from BindingDB
Found 2 hits for monomerid = 220633
TargetBromodomain-containing protein 4 [57-168](Homo sapiens (Human))
Abbvie
US Patent
LigandPNGBDBM220633(US9296741, 222)
Affinity DataKi:  225nM ΔG°:  -9.06kcal/molepH: 6.0 T: 2°C. Assay description: A time-resolved fluorescence resonance energy transfer (TR-FRET) assay was used to determine the affinities of compounds of the Examples listed in Ta...
Ligand InfoPC cidPC sid
In DepthDetails US Patent
TargetBromodomain-containing protein 4 [352-457](Homo sapiens (Human))
Abbvie
US Patent
LigandPNGBDBM220633(US9296741, 222)
Affinity DataKi:  969nM ΔG°:  -8.20kcal/molepH: 6.0 T: 2°C. Assay description: A time-resolved fluorescence resonance energy transfer (TR-FRET) assay was used to determine the affinities of compounds of the Examples listed in Ta...
Ligand InfoPC cidPC sid
In DepthDetails US Patent