BDBM221576 US9303045, 62::US9695195, 62
SMILES CN1C2CCC1CC(C2)NC(=O)c1nn(c2ccccc12)S(C)(=O)=O
InChI Key InChIKey=SWVNPIAPMGQOAZ-UHFFFAOYSA-N
Data  2 IC50
  Tab Delimited (TSV)   2D SDfile   Computed 3D by Vconf -m prep SDfile
Find this compound or compounds like it in BindingDB:
Activity Spreadsheet -- Enzyme Inhibition Constant Data from BindingDB
Found 2 hits for monomerid = 221576
Target5-hydroxytryptamine receptor 3A(Homo sapiens (Human))
Takeda Pharmaceutical
US Patent
LigandPNGBDBM221576(US9303045, 62 | US9695195, 62)
Affinity DataIC50:  0.75nMT: 2°C. Assay description: The 5HT3 antagonist activity of the compounds of the invention was determined by measuring the ability of the compounds to inhibit the calcium flux a...
Ligand InfoPC cidPC sid
In DepthDetails US Patent
Target5-hydroxytryptamine receptor 3A(Homo sapiens (Human))
Takeda Pharmaceutical
US Patent
LigandPNGBDBM221576(US9303045, 62 | US9695195, 62)
Affinity DataIC50:  0.75nMT: 2°C. Assay description: The 5HT3 antagonist activity of the compounds of the invention was determined by measuring the ability of the compounds to inhibit the calcium flux a...
Ligand InfoPC cidPC sid
In DepthDetails US Patent