BDBM2220 US8507676, 46::US8507676, 7B
SMILES C\C(=N/OCC(O)CO)c1ccc2nnc(Cc3ccc4ncccc4c3)n2n1
InChI Key InChIKey=JDVIAABOVWMJTC-DHRITJCHSA-N
Data  2 IC50
  Tab Delimited (TSV)   2D SDfile   Computed 3D by Vconf -m prep SDfile
Find this compound or compounds like it in BindingDB:
Activity Spreadsheet -- Enzyme Inhibition Constant Data from BindingDB
Found 2 hits for monomerid = 2220
TargetHepatocyte growth factor receptor(Homo sapiens (Human))
Novartis
US Patent
LigandPNGBDBM2220(US8507676, 46 | US8507676, 7B)
Affinity DataIC50:  120nM. Assay description: The kinase assay is based on the LanthaScreen technology. LanthaScreen is the detection of Time-Resolved Fluorescence Resonance Energy Transfer (TR-...
In DepthDetails US Patent
TargetHepatocyte growth factor receptor(Homo sapiens (Human))
Novartis
US Patent
LigandPNGBDBM2220(US8507676, 46 | US8507676, 7B)
Affinity DataIC50:  59nM. Assay description: The kinase assay is based on the LanthaScreen technology. LanthaScreen is the detection of Time-Resolved Fluorescence Resonance Energy Transfer (TR-...
In DepthDetails US Patent