BDBM222187 6-(Dimethylamino)-3-(2'-methoxyphenyl)-2,3-dihydronaphtho[1,8-de][1,2]thiazine 1,1-dioxide (7i)
SMILES COc1ccccc1C1NS(=O)(=O)c2cccc3c(ccc1c23)N(C)C
InChI Key InChIKey=XCFDDEOGVFLXBA-UHFFFAOYSA-N
Data  1 IC50
  Tab Delimited (TSV)   2D SDfile   Computed 3D by Vconf -m prep SDfile
Find this compound or compounds like it in BindingDB:
Activity Spreadsheet -- Enzyme Inhibition Constant Data from BindingDB
Found 1 hit for monomerid = 222187
TargetAlkaline phosphatase, tissue-nonspecific isozyme(Bos taurus (Cattle))
University Of Karachi
LigandPNGBDBM222187(6-(Dimethylamino)-3-(2'-methoxyphenyl)-2,3-dih...)
Affinity DataIC50:  310nMpH: 9.8 T: 2°C. Assay description: Alkaline phosphatase (b-TNAP, c-IAP purchased from Calzyme Laboratories, Inc. USA) inhibition assay of different cyclic sulfonamides was performed us...
Ligand InfoPC cidPC sid
In DepthDetails ArticlePubMed