BDBM222228 N-Hydroxy-4-((4-((3-(hydroxyimino)-5-methoxy-2-oxoindolin-1-yl)methyl)-1H-1,2,3-triazol-1-yl)methyl)benzamide (4f)
SMILES COc1ccc2N(Cc3cn(Cc4ccc(cc4)C(=O)NO)nn3)C(=O)\C(=N/O)c2c1
InChI Key InChIKey=YPMMXKMDKYIXSY-PYCFMQQDSA-N
Data  1 IC50
  Tab Delimited (TSV)   2D SDfile   Computed 3D by Vconf -m prep SDfile
Find this compound or compounds like it in BindingDB:
Activity Spreadsheet -- Enzyme Inhibition Constant Data from BindingDB
Found 1 hit for monomerid = 222228
TargetHistone deacetylase 2(Homo sapiens (Human))
Hanoi University Of Pharmacy
LigandPNGBDBM222228(N-Hydroxy-4-((4-((3-(hydroxyimino)-5-methoxy-2-oxo...)
Affinity DataIC50:  1.92E+3nM. Assay description: The HDAC enzymatic assay was performed using a Fluorogenic HDAC Assay Kit (BPS Bioscience) according to the manufacturer's instructions. Briefly,...
Ligand InfoPC cidPC sid
In DepthDetails ArticlePubMed