BDBM222331 (E)-4-(hydroxymethyl)-5-(3-hydroxystyryl)-2-methylpyridin-3-ol (6)
SMILES Cc1ncc(\C=C\c2cccc(O)c2)c(CO)c1O
InChI Key InChIKey=ACEPIOFLMRIEOX-AATRIKPKSA-N
Data  1 IC50
  Tab Delimited (TSV)   2D SDfile   Computed 3D by Vconf -m prep SDfile
Find this compound or compounds like it in BindingDB:
Activity Spreadsheet -- Enzyme Inhibition Constant Data from BindingDB
Found 1 hit for monomerid = 222331
TargetAmine oxidase [flavin-containing] B(Homo sapiens (Human))
Sichuan University
LigandPNGBDBM222331((E)-4-(hydroxymethyl)-5-(3-hydroxystyryl)-2-methyl...)
Affinity DataIC50:  1.69E+4nMpH: 7.4Assay Description:Recombinant human MAO-A and MAO-B (5 mg/mL) were purchased from Sigma-Aldrich, pre-aliquoted and stored at -80 °C. Solutions of test compounds we...
Ligand InfoPC cidPC sid
In DepthDetails ArticlePubMed