BDBM222532 US9315489, 68
SMILES COC(=O)c1ccc(cc1-c1cncnc1)C(=O)Nc1ccc(OC(F)(F)F)cc1
InChI Key InChIKey=SLCBWQFNFQSVAZ-UHFFFAOYSA-N
Data  2 IC50
  Tab Delimited (TSV)   2D SDfile   Computed 3D by Vconf -m prep SDfile
Find this compound or compounds like it in BindingDB:
Activity Spreadsheet -- Enzyme Inhibition Constant Data from BindingDB
Found 2 hits for monomerid = 222532
TargetTyrosine-protein kinase ABL1 [64-515](Homo sapiens (Human))
Novartis
US Patent
LigandPNGBDBM222532(US9315489, 68)
Affinity DataIC50:  1.60nMpH: 7.5 T: 2°C. Assay description: All assays were performed in 384-well microtiter plates. Each assay plate contained 8-point serial dilutions for 40 test compounds, as well as four 8...
Ligand InfoPC cidPC sid
In DepthDetails US Patent
TargetTyrosine-protein kinase ABL1 [64-515](Homo sapiens (Human))
Novartis
US Patent
LigandPNGBDBM222532(US9315489, 68)
Affinity DataIC50: <3nMpH: 7.5 T: 2°C. Assay description: For determination of ABL kinase activity, the radiometric filter-binding assay was used. The assay was performed by mixing 10 μL of the compound p...
Ligand InfoPC cidPC sid
In DepthDetails US Patent