BDBM223073 (E)-N'-(4'-Fluorobenzylidene)isonicotinohydrazide (3c)
SMILES Fc1ccc(\C=N\NC(=O)c2ccncc2)cc1
InChI Key InChIKey=SVYYQPLGBPBEQO-CXUHLZMHSA-N
Data  4 IC50
  Tab Delimited (TSV)   2D SDfile   Computed 3D by Vconf -m prep SDfile
Find this compound or compounds like it in BindingDB:
Activity Spreadsheet -- Enzyme Inhibition Constant Data from BindingDB
Found 4 hits for monomerid = 223073
Target5'-nucleotidase(Homo sapiens (Human))
Quaid-I-Azam University
LigandPNGBDBM223073((E)-N'-(4'-Fluorobenzylidene)isonicotinohy...)
Affinity DataIC50:  6.76E+3nMpH: 7.4 T: 2°C. Assay description: The enzymatic assay of both human and rat ecto-5'-nucleotidase were performed with slight modifications in the previously described method. The stock...
In DepthDetails ArticlePubMed
TargetIntestinal-type alkaline phosphatase(Bos taurus (Cattle))
Quaid-I-Azam University
LigandPNGBDBM223073((E)-N'-(4'-Fluorobenzylidene)isonicotinohy...)
Affinity DataIC50:  1.75E+4nMpH: 9.8 T: 2°C. Assay description: The assay conditions were optimized with some changes in formerly reported spectrophotometric method. The composition of assay buffer of pH 9.8 was a...
In DepthDetails ArticlePubMed
TargetAlkaline phosphatase, tissue-nonspecific isozyme(Bos taurus (Cattle))
Quaid-I-Azam University
LigandPNGBDBM223073((E)-N'-(4'-Fluorobenzylidene)isonicotinohy...)
Affinity DataIC50:  2.26E+3nMpH: 9.8 T: 2°C. Assay description: The assay conditions were optimized with some changes in formerly reported spectrophotometric method. The composition of assay buffer of pH 9.8 was a...
In DepthDetails ArticlePubMed
Target5'-nucleotidase(Rattus norvegicus (Rat))
Quaid-I-Azam University
LigandPNGBDBM223073((E)-N'-(4'-Fluorobenzylidene)isonicotinohy...)
Affinity DataIC50:  440nMpH: 7.4 T: 2°C. Assay description: The enzymatic assay of both human and rat ecto-5'-nucleotidase were performed with slight modifications in the previously described method. The stock...
In DepthDetails ArticlePubMed