BDBM223123 (Z)-N'-(1-benzyl-5-bromo-2-oxoindolin-3-ylidene)-2-((2-oxo-2H-chromen-7-yl)oxy)acetohydrazide (5r)
SMILES Brc1ccc2N(Cc3ccccc3)C(=O)\C(=N/NC(=O)COc3ccc4ccc(=O)oc4c3)c2c1
InChI Key InChIKey=LHEWQKZDZQKPPH-GNVQSUKOSA-N
Data  2 IC50
  Tab Delimited (TSV)   2D SDfile   Computed 3D by Vconf -m prep SDfile
Find this compound or compounds like it in BindingDB:
Activity Spreadsheet -- Enzyme Inhibition Constant Data from BindingDB
Found 2 hits for monomerid = 223123
TargetProbable maltase-glucoamylase 2(Homo sapiens)
Babasaheb Bhimrao Ambedkar University (A Central University)
Curated by ChEMBL
LigandPNGBDBM223123((Z)-N'-(1-benzyl-5-bromo-2-oxoindolin-3-yliden...)
Affinity DataIC50:  2.50E+3nM. Assay description: Inhibition of alpha-glucosidase (unknown origin) using p-nitrophenyl-alpha-d-glucopyranoside as substrate preincubated for 15 mins followed by substr...
Ligand InfoPC cidPC sid
In DepthDetails ArticlePubMed
TargetAlpha-glucosidase MAL32(Saccharomyces cerevisiae)
Jishou University
LigandPNGBDBM223123((Z)-N'-(1-benzyl-5-bromo-2-oxoindolin-3-yliden...)
Affinity DataIC50:  4.48E+3nMpH: 6.8Assay Description:The test compounds were dissolved in DMSO to prepare the required distributing concentration. α-Glucosidase inhibitory activity was assayed usin...
Ligand InfoPC cidPC sid
In DepthDetails ArticlePubMed