BDBM223538 US9321743, Cbz-L-Ala
SMILES C[C@H](NC(=O)OCc1ccccc1)C(O)=O
InChI Key InChIKey=TYRGLVWXHJRKMT-QMMMGPOBSA-N
Data  1 IC50
PDB links: 6 PDB IDs match this monomer.
  Tab Delimited (TSV)   2D SDfile   Computed 3D by Vconf -m prep SDfile
Find this compound or compounds like it in BindingDB:
Activity Spreadsheet -- Enzyme Inhibition Constant Data from BindingDB
Found 1 hit for monomerid = 223538
TargetN-acylethanolamine-hydrolyzing acid amidase(Rattus norvegicus (Rat))
University Of California
US Patent
LigandPNGBDBM223538(US9321743, Cbz-L-Ala)
Affinity DataIC50: >1.00E+5nMpH: 5.0 T: 2°C. Assay description: Recombinant NAAA or native rat lung NAAA was incubated at 37 °C. for 30 min in 0.2 ml of sodium hydrogen phosphate buffer (50 mM, pH 5.0) contain...
In DepthDetails US Patent