BDBM22399 2-[(1R,2S,3S,5S)-3-(4-chlorophenyl)-8-methyl-8-azabicyclo[3.2.1]octan-2-yl]-5-(4-fluorophenyl)-1,3-thiazole::WIN 35,065-2 Analogue, 4b
SMILES CN1[C@H]2CC[C@@H]1[C@H]([C@H](C2)c1ccc(Cl)cc1)c1ncc(s1)-c1ccc(F)cc1
InChI Key InChIKey=ZPAUAFZKIQYYOJ-HIUFNZKISA-N
Data  5 KI  1 IC50  3 EC50
  Tab Delimited (TSV)   2D SDfile   Computed 3D by Vconf -m prep SDfile
Find this compound or compounds like it in BindingDB:
Activity Spreadsheet -- Enzyme Inhibition Constant Data from BindingDB
Found 6 hits for monomerid = 22399
TargetSodium-dependent dopamine transporter(Homo sapiens (Human))
Research Triangle Institute
LigandPNGBDBM22399(2-[(1R,2S,3S,5S)-3-(4-chlorophenyl)-8-methyl-8-aza...)
Affinity DataKi:  12nM EC50:  30nM. Assay description: Membranes were preincubated with drugs before the addition of [125I]RTI-55. The reaction was terminated by filtration through Wallac Filtermat A filt...
In DepthDetails ArticlePubMed
TargetSodium-dependent serotonin transporter(Rattus norvegicus (rat))
Research Triangle Institute
LigandPNGBDBM22399(2-[(1R,2S,3S,5S)-3-(4-chlorophenyl)-8-methyl-8-aza...)
Affinity DataKi:  371nM ΔG°:  -8.77kcal/molepH: 7.4 T: 2°C. Assay description: Brains from male Sprague-Dawley rats were removed, dissected, and rapidly frozen. Ligand binding experiments were conducted in assay tubes containing...
In DepthDetails ArticlePubMed
TargetSodium-dependent serotonin transporter(Homo sapiens (Human))
Research Triangle Institute
LigandPNGBDBM22399(2-[(1R,2S,3S,5S)-3-(4-chlorophenyl)-8-methyl-8-aza...)
Affinity DataKi:  653nM EC50:  1.01E+3nM. Assay description: Membranes were preincubated with drugs before the addition of [125I]RTI-55. The reaction was terminated by filtration through Wallac Filtermat A filt...
In DepthDetails ArticlePubMed
TargetSodium-dependent noradrenaline transporter(Homo sapiens (Human))
Research Triangle Institute
LigandPNGBDBM22399(2-[(1R,2S,3S,5S)-3-(4-chlorophenyl)-8-methyl-8-aza...)
Affinity DataKi:  1.70E+3nM EC50:  690nM. Assay description: Membranes were preincubated with drugs before the addition of [125I]RTI-55. The reaction was terminated by filtration through Wallac Filtermat A filt...
In DepthDetails ArticlePubMed
TargetTransporter(Rattus norvegicus (rat))
Research Triangle Institute
LigandPNGBDBM22399(2-[(1R,2S,3S,5S)-3-(4-chlorophenyl)-8-methyl-8-aza...)
Affinity DataKi: >2.00E+3nM. Assay description: Brains from male Sprague-Dawley rats were removed, dissected, and rapidly frozen. Ligand binding experiments were conducted in assay tubes containing...
In DepthDetails ArticlePubMed
TargetSodium-dependent dopamine transporter(Rattus norvegicus (rat))
Research Triangle Institute
LigandPNGBDBM22399(2-[(1R,2S,3S,5S)-3-(4-chlorophenyl)-8-methyl-8-aza...)
Affinity DataIC50:  6nMpH: 7.4 T: 2°C. Assay description: Brains from male Sprague-Dawley rats were removed, dissected, and rapidly frozen. Ligand binding experiments were conducted in assay tubes containing...
In DepthDetails ArticlePubMed