BDBM224771 US9328120, 1
SMILES Cc1cc(on1)[C@@H]1CC[C@H]1c1nc2n(ncc2c(=O)[nH]1)C1CCC(F)(F)CC1
InChI Key
Data  1 IC50
  Tab Delimited (TSV)   2D SDfile   Computed 3D by Vconf -m prep SDfile
Find this compound or compounds like it in BindingDB:
Activity Spreadsheet -- Enzyme Inhibition Constant Data from BindingDB
Found 1 hit for monomerid = 224771
TargetIsoform PDE9A2 of High affinity cGMP-specific 3',5'-cyclic phosphodiesterase 9A (PDE9A2)(Homo sapiens (Human))
Boehringer Ingelheim International
US Patent
LigandPNGBDBM224771(US9328120, 1)
Affinity DataIC50:  450nMT: 2°C. Assay description: The PDE9A2 enzymatic activity assay was run as scintillation proximity assay (SPA), in general according to the protocol of the manufacturer (GE Heal...
Ligand InfoPC cidPC sid
In DepthDetails US Patent