BDBM224985 US9321756, 252
SMILES CC[C@@H]1COCCN1c1nnc(o1)-c1ccc2[nH]cc(-c3cncc(n3)C3CC3)c2c1
InChI Key
Data  2 IC50
  Tab Delimited (TSV)   2D SDfile   Computed 3D by Vconf -m prep SDfile
Find this compound or compounds like it in BindingDB:
Activity Spreadsheet -- Enzyme Inhibition Constant Data from BindingDB
Found 2 hits for monomerid = 224985
TargetSerine/threonine-protein kinase pim-2(Homo sapiens (Human))
Amgen
US Patent
LigandPNGBDBM224985(US9321756, 252)
Affinity DataIC50:  29.8nM. Assay description: The assay for the determination of Pim activity is based on the formation of phosphorylated biotinylated-BAD peptide at the Serine 112 residue (S112)...
Ligand InfoPC cidPC sid
In DepthDetails US Patent
TargetSerine/threonine-protein kinase pim-1(Homo sapiens (Human))
Amgen
US Patent
LigandPNGBDBM224985(US9321756, 252)
Affinity DataIC50:  9.66nM. Assay description: The assay for the determination of Pim activity is based on the formation of phosphorylated biotinylated-BAD peptide at the Serine 112 residue (S112)...
Ligand InfoPC cidPC sid
In DepthDetails US Patent