BDBM225382 erk000232
SMILES Clc1cccc(c1)-c1cn[nH]c1-c1c[nH]c(c1)C(=O)NCc1ccc2OCCc2c1
InChI Key InChIKey=IVRHNXDBTVKZAH-UHFFFAOYSA-N
Data  1 KI
PDB links: 1 PDB ID matches this monomer.
  Tab Delimited (TSV)   2D SDfile   Computed 3D by Vconf -m prep SDfile
Find this compound or compounds like it in BindingDB:
Activity Spreadsheet -- Enzyme Inhibition Constant Data from BindingDB
Found 1 hit for monomerid = 225382
TargetMitogen-activated protein kinase 1(Homo sapiens (Human))
D3R/Abbott
LigandPNGBDBM225382(erk000232)
Affinity DataKi:  20.9nM. Assay description: Photometric_Method2
Ligand InfoPC cidPC sidPDB