BDBM227230 US9328106, 181
SMILES Cn1ncc(NC(=O)c2nc(sc2N)-c2cccc(F)c2F)c1[C@@H]1CC[C@@H](N)[C@@H](F)CO1
InChI Key InChIKey=ZHOFPMKYJUYBTO-SCRDCRAPSA-N
Data  1 KI
  Tab Delimited (TSV)   2D SDfile   Computed 3D by Vconf -m prep SDfile
Find this compound or compounds like it in BindingDB:
Activity Spreadsheet -- Enzyme Inhibition Constant Data from BindingDB
Found 1 hit for monomerid = 227230
TargetSerine/threonine-protein kinase pim-1(Homo sapiens (Human))
Genentech
US Patent
LigandPNGBDBM227230(US9328106, 181)
Affinity DataKi:  0.00400nM ΔG°:  -15.5kcal/molepH: 7.2 T: 2°C. Assay description: LC3K assay: PIM-1, -2, and -3 enzymes were generated as fusion proteins expressed in bacteria and purified by IMAC column chromatography (Sun, X., Ch...
Ligand InfoPC cidPC sid
In DepthDetails US Patent