BDBM227432 US9328106, 385
SMILES CN(C)c1ccc(cn1)-c1nc(cs1)C(=O)Nc1cnn(C)c1[C@@H]1CC[C@@H](N)[C@H](F)CO1
InChI Key InChIKey=QQXIXLGSMHWJSM-CPUCHLNUSA-N
Data  1 KI
  Tab Delimited (TSV)   2D SDfile   Computed 3D by Vconf -m prep SDfile
Find this compound or compounds like it in BindingDB:
Activity Spreadsheet -- Enzyme Inhibition Constant Data from BindingDB
Found 1 hit for monomerid = 227432
TargetSerine/threonine-protein kinase pim-1(Homo sapiens (Human))
Genentech
US Patent
LigandPNGBDBM227432(US9328106, 385)
Affinity DataKi:  0.200nM ΔG°:  -13.2kcal/molepH: 7.2 T: 2°C. Assay description: LC3K assay: PIM-1, -2, and -3 enzymes were generated as fusion proteins expressed in bacteria and purified by IMAC column chromatography (Sun, X., Ch...
Ligand InfoPC cidPC sid
In DepthDetails US Patent