BDBM227489 US9334271, 10
SMILES C[C@H]1COCCN1c1nc(N2CCOC[C@@H]2C)c2nc([nH]c2n1)-c1cc[nH]n1
InChI Key InChIKey=NCFLUONREOCXNV-NWKFZWBHSA-N
Data  1 IC50
  Tab Delimited (TSV)   2D SDfile   Computed 3D by Vconf -m prep SDfile
Find this compound or compounds like it in BindingDB:
Activity Spreadsheet -- Enzyme Inhibition Constant Data from BindingDB
Found 1 hit for monomerid = 227489
TargetSerine/threonine-protein kinase mTOR(Homo sapiens (Human))
Novarits
US Patent
LigandPNGBDBM227489(US9334271, 10)
Affinity DataIC50:  343nMpH: 7.5 T: 2°C. Assay description: 1. 8-point serial dilutions of compounds (10 mM stock) are performed in 90% DMSO in a 384-well "masterplate" and 50 nL is transferred onto 384-well a...
Ligand InfoPC cidPC sid
In DepthDetails US Patent