BDBM227704 3-{6-(3-chlorophenyl)-7- [(trans-4- methylcyclohexyl)methyl]- 8-[1-(tetrahydro-2h- pyran-4-yl)ethyl]-7h- purin-2-yl}-1,2,4- oxadiazol-5(4h)-one::US9540377, 24.3
SMILES CC(C1CCOCC1)c1nc2nc(nc(-c3cccc(Cl)c3)c2n1C[C@H]1CC[C@H](C)CC1)-c1noc(=O)[nH]1
InChI Key
Data  1 IC50
  Tab Delimited (TSV)   2D SDfile   Computed 3D by Vconf -m prep SDfile
Find this compound or compounds like it in BindingDB:
Activity Spreadsheet -- Enzyme Inhibition Constant Data from BindingDB
Found 1 hit for monomerid = 227704
TargetE3 ubiquitin-protein ligase Mdm2 [17-125](Homo sapiens (Human))
Merck Sharp & Dohme
US Patent
LigandPNGBDBM227704(3-{6-(3-chlorophenyl)-7- [(trans-4- methylcyclohex...)
Affinity DataIC50:  14.2nMT: 2°C. Assay description: An HDM2 FRET assay was developed to assess the compounds' inhibitory activity towards binding of p53 protein. A truncated version of HDM2 with re...
Ligand InfoPC cidPC sid
In DepthDetails US Patent