BDBM227738 US9540377, 6.83
SMILES CCCCN(C)c1nc(nc2nc(-c3cccc(C)c3)n(Cc3ccc(cc3)C(F)(F)F)c12)C(O)=O
InChI Key InChIKey=RSNGROLHVQESAP-UHFFFAOYSA-N
Data  1 IC50
  Tab Delimited (TSV)   2D SDfile   Computed 3D by Vconf -m prep SDfile
Find this compound or compounds like it in BindingDB:
Activity Spreadsheet -- Enzyme Inhibition Constant Data from BindingDB
Found 1 hit for monomerid = 227738
TargetE3 ubiquitin-protein ligase Mdm2 [17-125](Homo sapiens (Human))
Merck Sharp & Dohme
US Patent
LigandPNGBDBM227738(US9540377, 6.83)
Affinity DataIC50:  834nMT: 2°C. Assay description: An HDM2 FRET assay was developed to assess the compounds' inhibitory activity towards binding of p53 protein. A truncated version of HDM2 with re...
Ligand InfoPC cidPC sid
In DepthDetails US Patent