BDBM227835 US10047096, 96
SMILES COc1cccc(CNCc2ccc3Nc4nccc(Nc5cc(O)ccc5C)c4C(=O)Nc3c2)c1
InChI Key InChIKey=HUQSQQXBXUUYED-UHFFFAOYSA-N
Data  2 IC50
  Tab Delimited (TSV)   2D SDfile   Computed 3D by Vconf -m prep SDfile
Find this compound or compounds like it in BindingDB:
Activity Spreadsheet -- Enzyme Inhibition Constant Data from BindingDB
Found 2 hits for monomerid = 227835
TargetPlatelet-derived growth factor receptor beta(Homo sapiens (Human))
Bayer Pharma Aktiengesellschaft
US Patent
LigandPNGBDBM227835(US10047096, 96)
Affinity DataIC50:  2.10nMpH: 7.5 T: 2°C. Assay description: The kinase used was a recombinant fusion protein composed of N-terminal GST and a C-terminal fragment of human PDGFRβ (amino acids R561-L1106), expr...
Ligand InfoPC cidPC sid
In DepthDetails US Patent
TargetVascular endothelial growth factor receptor 2(Homo sapiens (Human))
Bayer Pharma Aktiengesellschaft
US Patent
LigandPNGBDBM227835(US10047096, 96)
Affinity DataIC50:  5.03nMpH: 7.0Assay Description:The kinase used was a recombinant fusion protein composed of N-terminal GST and a C-terminal fragment of human KDR (amino acids D807-V1356), expresse...
Ligand InfoPC cidPC sid
In DepthDetails US Patent