BDBM227900 4-[(2-Fluoro-5-hydroxy-4-methylphenyl)amino]-8-{[4-(2-hydroxyethyl)piperidin-1-yl]carbonyl}-6,11-dihydro-5H-pyrido[2,3-b][1,5]benzodiazepin-5-one::US10047096, 161
SMILES Cc1cc(F)c(Nc2ccnc3Nc4ccc(cc4NC(=O)c23)C(=O)N2CCC(CCO)CC2)cc1O
InChI Key InChIKey=VTBJZDMBUWEQBI-UHFFFAOYSA-N
Data  2 IC50
  Tab Delimited (TSV)   2D SDfile   Computed 3D by Vconf -m prep SDfile
Find this compound or compounds like it in BindingDB:
Activity Spreadsheet -- Enzyme Inhibition Constant Data from BindingDB
Found 2 hits for monomerid = 227900
TargetPlatelet-derived growth factor receptor beta(Homo sapiens (Human))
Bayer Pharma Aktiengesellschaft
US Patent
LigandPNGBDBM227900(4-[(2-Fluoro-5-hydroxy-4-methylphenyl)amino]-8-{[4...)
Affinity DataIC50:  10.7nMpH: 7.5 T: 2°C. Assay description: The kinase used was a recombinant fusion protein composed of N-terminal GST and a C-terminal fragment of human PDGFRβ (amino acids R561-L1106), expr...
Ligand InfoPC cidPC sid
In DepthDetails US Patent
TargetVascular endothelial growth factor receptor 2(Homo sapiens (Human))
Bayer Pharma Aktiengesellschaft
US Patent
LigandPNGBDBM227900(4-[(2-Fluoro-5-hydroxy-4-methylphenyl)amino]-8-{[4...)
Affinity DataIC50:  1.83nMpH: 7.0Assay Description:The kinase used was a recombinant fusion protein composed of N-terminal GST and a C-terminal fragment of human KDR (amino acids D807-V1356), expresse...
Ligand InfoPC cidPC sid
In DepthDetails US Patent