BDBM228069 US9556160, ex 11
SMILES CC(=O)N1CCC(COc2ncc(cn2)-c2cccc(COC(=O)NC(N)=N)c2F)CC1
InChI Key InChIKey=CIQXENGVUDJJJL-UHFFFAOYSA-N
Data  2 IC50
  Tab Delimited (TSV)   2D SDfile   Computed 3D by Vconf -m prep SDfile
Find this compound or compounds like it in BindingDB:
Activity Spreadsheet -- Enzyme Inhibition Constant Data from BindingDB
Found 2 hits for monomerid = 228069
TargetMembrane primary amine oxidase(Rattus norvegicus (Rat))
Astellas Pharma
US Patent
LigandPNGBDBM228069(US9556160, ex 11)
Affinity DataIC50:  2.20nMT: 2°C. Assay description: A rat VAP-1 enzyme (SSAO) (reference: Biol Pharm Bull. 2005 March; 28(3): 413-8) activity was measured by a radiochemistry-enzymatic assay using 14C-...
Ligand InfoPC cidPC sid
In DepthDetails US Patent
TargetMembrane primary amine oxidase(Homo sapiens (Human))
Astellas Pharma
US Patent
LigandPNGBDBM228069(US9556160, ex 11)
Affinity DataIC50:  5.20nMT: 2°C. Assay description: A human VAP-1 enzyme (SSAO) (reference: J Exp Med. 1998 Jul. 6; 188(1): 17 to 27) activity was measured by a radiochemistry-enzymatic assay using 14C...
Ligand InfoPC cidPC sid
In DepthDetails US Patent