BDBM228080 US9556160, ex 157
SMILES CCS(=O)(=O)N1CCN(CC1)c1cccc(COC(=O)CC(N)=N)c1F
InChI Key InChIKey=LRLUNNRYUAEZFX-UHFFFAOYSA-N
Data  2 IC50
  Tab Delimited (TSV)   2D SDfile   Computed 3D by Vconf -m prep SDfile
Find this compound or compounds like it in BindingDB:
Activity Spreadsheet -- Enzyme Inhibition Constant Data from BindingDB
Found 2 hits for monomerid = 228080
TargetMembrane primary amine oxidase(Rattus norvegicus (Rat))
Astellas Pharma
US Patent
LigandPNGBDBM228080(US9556160, ex 157)
Affinity DataIC50:  2.10nMT: 2°C. Assay description: A rat VAP-1 enzyme (SSAO) (reference: Biol Pharm Bull. 2005 March; 28(3): 413-8) activity was measured by a radiochemistry-enzymatic assay using 14C-...
Ligand InfoPC cidPC sid
In DepthDetails US Patent
TargetMembrane primary amine oxidase(Homo sapiens (Human))
Astellas Pharma
US Patent
LigandPNGBDBM228080(US9556160, ex 157)
Affinity DataIC50:  49nMT: 2°C. Assay description: A human VAP-1 enzyme (SSAO) (reference: J Exp Med. 1998 Jul. 6; 188(1): 17 to 27) activity was measured by a radiochemistry-enzymatic assay using 14C...
Ligand InfoPC cidPC sid
In DepthDetails US Patent