BDBM228081 US9556160, ex 178
SMILES NC(=N)CC(=O)OCc1cccc(c1)-c1cnc(nc1)N1CC[C@H](F)C1
InChI Key InChIKey=HSSFLPYUGDUYNV-HNNXBMFYSA-N
Data  2 IC50
  Tab Delimited (TSV)   2D SDfile   Computed 3D by Vconf -m prep SDfile
Find this compound or compounds like it in BindingDB:
Activity Spreadsheet -- Enzyme Inhibition Constant Data from BindingDB
Found 2 hits for monomerid = 228081
TargetMembrane primary amine oxidase(Rattus norvegicus (Rat))
Astellas Pharma
US Patent
LigandPNGBDBM228081(US9556160, ex 178)
Affinity DataIC50:  4.40nMT: 2°C. Assay description: A rat VAP-1 enzyme (SSAO) (reference: Biol Pharm Bull. 2005 March; 28(3): 413-8) activity was measured by a radiochemistry-enzymatic assay using 14C-...
Ligand InfoPC cidPC sid
In DepthDetails US Patent
TargetMembrane primary amine oxidase(Homo sapiens (Human))
Astellas Pharma
US Patent
LigandPNGBDBM228081(US9556160, ex 178)
Affinity DataIC50:  33nMT: 2°C. Assay description: A human VAP-1 enzyme (SSAO) (reference: J Exp Med. 1998 Jul. 6; 188(1): 17 to 27) activity was measured by a radiochemistry-enzymatic assay using 14C...
Ligand InfoPC cidPC sid
In DepthDetails US Patent