BDBM2283 5Cl3PhS-2IndolCONH2 inhibitor 9b::methyl 5-chloro-3-(phenylsulfanyl)-1H-indole-2-carboxylate
SMILES COC(=O)c1[nH]c2ccc(Cl)cc2c1Sc1ccccc1
InChI Key InChIKey=KTNJDRXZRDQUKW-UHFFFAOYSA-N
Data  1 IC50
  Tab Delimited (TSV)   2D SDfile   Computed 3D by Vconf -m prep SDfile
Find this compound or compounds like it in BindingDB:
Activity Spreadsheet -- Enzyme Inhibition Constant Data from BindingDB
Found 1 hit for monomerid = 2283
TargetGag-Pol polyprotein [588-1027]/[588-1147](Human immunodeficiency virus type 1)
Merck Research Laboratories
LigandPNGBDBM2283(5Cl3PhS-2IndolCONH2 inhibitor 9b | methyl 5-chloro...)
Affinity DataIC50:  156nMpH: 8.2Assay Description:The IC50 of reverse transcriptase is the concentration that inhibits 50% of recombinant HIV-1 RT RNA-directed DNA polymerase activity in vitro.
In DepthDetails ArticlePubMed