BDBM228298 2-Chloro-4-(((6-methoxy-2-(6-methylimidazo[1,2-b]pyridazin-2-yl)benzofuran-4-yl)oxy)methyl)thiazole::US10047103, 206
SMILES COc1cc(OCc2csc(C)n2)c2cc(oc2c1)-c1cn2nc(C)ccc2n1
InChI Key InChIKey=WYDHXOQAJJLMAW-UHFFFAOYSA-N
Data  1 EC50
  Tab Delimited (TSV)   2D SDfile   Computed 3D by Vconf -m prep SDfile
Find this compound or compounds like it in BindingDB:
Activity Spreadsheet -- Enzyme Inhibition Constant Data from BindingDB
Found 1 hit for monomerid = 228298
TargetProteinase-activated receptor 4(Homo sapiens (Human))
Bristol-Myers Squibb
US Patent
LigandPNGBDBM228298( 2-Chloro-4-(((6-methoxy-2-(6-methylimidazo[1,2-b]...)
Affinity DataEC50:  12nMT: 2°C. Assay description: The activity of the PAR4 antagonists of the present invention were tested in PAR4 expressing cells by monitoring H-Ala-Phe(4-F)-Pro-Gly-Trp-Leu-Val-L...
Ligand InfoPC cidPC sid
In DepthDetails US Patent