BDBM228321 US9555022, Example 03.05
SMILES COc1cc(ccc1Nc1nc2ccc(cn2n1)-c1ccc(cc1)C(=O)NCC1CC1)N1CCN(C)CC1
InChI Key InChIKey=JAIIHSQYVXPJPG-UHFFFAOYSA-N
Data  1 IC50
  Tab Delimited (TSV)   2D SDfile   Computed 3D by Vconf -m prep SDfile
Find this compound or compounds like it in BindingDB:
Activity Spreadsheet -- Enzyme Inhibition Constant Data from BindingDB
Found 1 hit for monomerid = 228321
TargetDual specificity protein kinase TTK(Homo sapiens (Human))
Bayer Intellectual Property
US Patent
LigandPNGBDBM228321(US9555022, Example 03.05)
Affinity DataIC50:  6.33nMpH: 7.7Assay Description:For the assay 50 nl of a 100-fold concentrated solution of the test compound in DMSO was pipetted into a black low volume 384 well microtiter plate (...
Ligand InfoPC cidPC sid
In DepthDetails US Patent