BDBM22836 5-chloro-7-methyl-2,3-dihydro-1H-indole-2,3-dione::Isatin-based compound, 56
SMILES Cc1cc(Cl)cc2C(=O)C(=O)Nc12
InChI Key InChIKey=LDFQLYHDZZPAGN-UHFFFAOYSA-N
Data  5 KI
  Tab Delimited (TSV)   2D SDfile   Computed 3D by Vconf -m prep SDfile
Find this compound or compounds like it in BindingDB:
Activity Spreadsheet -- Enzyme Inhibition Constant Data from BindingDB
Found 5 hits for monomerid = 22836
TargetLiver carboxylesterase 1(Oryctolagus cuniculus (rabbit))
St. Jude Research Hospital
LigandPNGBDBM22836(5-chloro-7-methyl-2,3-dihydro-1H-indole-2,3-dione ...)
Affinity DataKi:  1.41E+4nM. Assay description: CE inhibition was determined using a spectrophotometric multiwell plate assay with o-NPA as a substrate. The rate of change in absorbance at 420 nm w...
In DepthDetails ArticlePubMed
TargetCoagulation factor XII(Homo sapiens (Human))
St. Jude Research Hospital
LigandPNGBDBM22836(5-chloro-7-methyl-2,3-dihydro-1H-indole-2,3-dione ...)
Affinity DataKi:  2.18E+4nM. Assay description: CE inhibition was determined using a spectrophotometric multiwell plate assay with o-NPA as a substrate. The rate of change in absorbance at 420 nm w...
In DepthDetails ArticlePubMed
TargetLiver carboxylesterase 1(Homo sapiens (Human))
St. Jude Research Hospital
LigandPNGBDBM22836(5-chloro-7-methyl-2,3-dihydro-1H-indole-2,3-dione ...)
Affinity DataKi:  3.41E+4nM. Assay description: CE inhibition was determined using a spectrophotometric multiwell plate assay with o-NPA as a substrate. The rate of change in absorbance at 420 nm w...
In DepthDetails ArticlePubMed
TargetCholinesterase(Homo sapiens (Human))
St. Jude Research Hospital
LigandPNGBDBM22836(5-chloro-7-methyl-2,3-dihydro-1H-indole-2,3-dione ...)
Affinity DataKi: >1.00E+5nM. Assay description: The cholinesterase assays were performed using colorimetric method reported by Ellman. Estimates of the competitive inhibition constants (Ki) were ob...
In DepthDetails ArticlePubMed
TargetAcetylcholinesterase(Homo sapiens (Human))
St. Jude Research Hospital
LigandPNGBDBM22836(5-chloro-7-methyl-2,3-dihydro-1H-indole-2,3-dione ...)
Affinity DataKi: >1.00E+5nM. Assay description: The cholinesterase assays were performed using colorimetric method reported by Ellman. Estimates of the competitive inhibition constants (Ki) were ob...
In DepthDetails ArticlePubMed