BDBM228482 US9340521, E029
SMILES COc1ccc(Cc2cc([C@@H]3O[C@H](SO)[C@@H](O)[C@H](O)[C@H]3O)c3OCCCc3c2Cl)cc1
InChI Key InChIKey=YDPXOPNHSNPKIN-PIBZIWMISA-N
Data  2 IC50
  Tab Delimited (TSV)   2D SDfile   Computed 3D by Vconf -m prep SDfile
Find this compound or compounds like it in BindingDB:
Activity Spreadsheet -- Enzyme Inhibition Constant Data from BindingDB
Found 2 hits for monomerid = 228482
TargetSodium/glucose cotransporter 1(Homo sapiens (Human))
Green Cross
US Patent
LigandPNGBDBM228482(US9340521, E029)
Affinity DataIC50:  21.1nMpH: 7.4 T: 2°C. Assay description: For sodium-dependent glucose transport assay, cells expressing hSGLT1 were seeded into a 96-well culture plate at a density of 5×104 cells/well...
Ligand InfoKEGGPC cidPC sid
In DepthDetails US Patent
TargetSodium/glucose cotransporter 2(Homo sapiens (Human))
Green Cross
US Patent
LigandPNGBDBM228482(US9340521, E029)
Affinity DataIC50:  0.470nMpH: 7.4 T: 2°C. Assay description: For sodium-dependent glucose transport assay, cells expressing hSGLT2 were seeded into a 96-well culture plate at a density of 5×104 cells/well...
Ligand InfoKEGGPC cidPC sid
In DepthDetails US Patent