BDBM228655 CAV (90-99)::TTFTVTKYWF
SMILES CC(C)[C@H](NC(=O)[C@@H](NC(=O)[C@H](Cc1ccccc1)NC(=O)[C@@H](NC(=O)[C@@H](N)[C@@H](C)O)[C@@H](C)O)[C@@H](C)O)C(=O)N[C@@H]([C@@H](C)O)C(=O)N[C@@H](CCCCN)C(=O)N[C@@H](Cc1ccc(O)cc1)C(=O)N[C@@H](Cc1c[nH]c2ccccc12)C(=O)N[C@@H](Cc1ccccc1)C(O)=O
InChI Key
Data  1 Kd
  Tab Delimited (TSV)   2D SDfile   Computed 3D by Vconf -m prep SDfile
Find this compound or compounds like it in BindingDB:
Activity Spreadsheet -- Enzyme Inhibition Constant Data from BindingDB
Found 1 hit for monomerid = 228655
TargetNitric oxide synthase, endothelial(Bos taurus (bovine))
St. Paul'S Hospital'S Centre Of Heart And Lung Innovation
LigandPNGBDBM228655(CAV (90-99) | TTFTVTKYWF)
Affinity DataKd:  42nMpH: 7.5 T: 2°C. Assay description: eNOS was diluted to varying concentrations in buffer containing 50 mM inorganic phosphate, 50 mM KCl, and 5 mM DTT, pH 7.5. A spectrophotometer was u...
Ligand InfoPC cidPC sid
In DepthDetails ArticlePubMed