BDBM228672 US10369153, Compound 86::US9346810, 86
SMILES COc1cc2ncnc(N(C)[C@@H]3CCN(C3)c3ncnc4[nH]ccc34)c2cc1OC
InChI Key InChIKey=NKZDARSZVOPRKB-CYBMUJFWSA-N
Data  6 IC50
  Tab Delimited (TSV)   2D SDfile   Computed 3D by Vconf -m prep SDfile
Find this compound or compounds like it in BindingDB:
Activity Spreadsheet -- Enzyme Inhibition Constant Data from BindingDB
Found 6 hits for monomerid = 228672
TargetTyrosine-protein kinase JAK1 [866-1154](Homo sapiens (Human))
Hutchison Medipharma
US Patent
LigandPNGBDBM228672(US10369153, Compound 86 | US9346810, 86)
Affinity DataIC50:  0.0550nMT: 2°C. Assay description: JAK1/2/3 kinase assay are performed in vitro using Kit-Tyr 6 Peptide (Invitrogen, Cat. No. PV4122). TYK2 kinase assay are performed in vitro using Z'...
Ligand InfoPC cidPC sid
In DepthDetails US Patent
TargetTyrosine-protein kinase JAK2 [808-1132](Homo sapiens (Human))
Hutchison Medipharma
US Patent
LigandPNGBDBM228672(US10369153, Compound 86 | US9346810, 86)
Affinity DataIC50:  0.0550nMT: 2°C. Assay description: JAK1/2/3 kinase assay are performed in vitro using Kit-Tyr 6 Peptide (Invitrogen, Cat. No. PV4122). TYK2 kinase assay are performed in vitro using Z'...
Ligand InfoPC cidPC sid
In DepthDetails US Patent
TargetTyrosine-protein kinase JAK3(Homo sapiens (Human))
Hutchison Medipharma
US Patent
LigandPNGBDBM228672(US10369153, Compound 86 | US9346810, 86)
Affinity DataIC50:  550nM. Assay description: JAK1/2/3 kinase assay are performed in vitro using Kit-Tyr 6 Peptide (Invitrogen, Cat. No. PV4122). TYK2 kinase assay are performed in vitro using Z&...
Ligand InfoPC cidPC sid
In DepthDetails US Patent
TargetTyrosine-protein kinase JAK1(Homo sapiens (Human))
Hutchison Medipharma
US Patent
LigandPNGBDBM228672(US10369153, Compound 86 | US9346810, 86)
Affinity DataIC50: <100nM. Assay description: JAK1/2/3 kinase assay are performed in vitro using Kit-Tyr 6 Peptide (Invitrogen, Cat. No. PV4122). TYK2 kinase assay are performed in vitro using Z&...
Ligand InfoPC cidPC sid
In DepthDetails US Patent
TargetTyrosine-protein kinase JAK2(Homo sapiens (Human))
Hutchison Medipharma
US Patent
LigandPNGBDBM228672(US10369153, Compound 86 | US9346810, 86)
Affinity DataIC50: <100nM. Assay description: JAK1/2/3 kinase assay are performed in vitro using Kit-Tyr 6 Peptide (Invitrogen, Cat. No. PV4122). TYK2 kinase assay are performed in vitro using Z&...
Ligand InfoPC cidPC sid
In DepthDetails US Patent
TargetTyrosine-protein kinase JAK3 [781-1124](Homo sapiens (Human))
Hutchison Medipharma
US Patent
LigandPNGBDBM228672(US10369153, Compound 86 | US9346810, 86)
Affinity DataIC50:  0.550nMT: 2°C. Assay description: JAK1/2/3 kinase assay are performed in vitro using Kit-Tyr 6 Peptide (Invitrogen, Cat. No. PV4122). TYK2 kinase assay are performed in vitro using Z'...
Ligand InfoPC cidPC sid
In DepthDetails US Patent