BDBM228759 US9346810, 208
SMILES CN([C@@H]1CCN(C1)c1ncnc2[nH]ccc12)c1c(F)cc(cc1F)C(=O)N[C@H](CO)c1ccccc1
InChI Key InChIKey=WGCLQYPBHLZIGD-XMSQKQJNSA-N
Data  2 IC50
  Tab Delimited (TSV)   2D SDfile   Computed 3D by Vconf -m prep SDfile
Find this compound or compounds like it in BindingDB:
Activity Spreadsheet -- Enzyme Inhibition Constant Data from BindingDB
Found 2 hits for monomerid = 228759
TargetTyrosine-protein kinase JAK3 [781-1124](Homo sapiens (Human))
Hutchison Medipharma
US Patent
LigandPNGBDBM228759(US9346810, 208)
Affinity DataIC50:  0.0550nMT: 2°C. Assay description: JAK1/2/3 kinase assay are performed in vitro using Kit-Tyr 6 Peptide (Invitrogen, Cat. No. PV4122). TYK2 kinase assay are performed in vitro using Z'...
Ligand InfoPC cidPC sid
In DepthDetails US Patent
TargetTyrosine-protein kinase JAK2 [808-1132](Homo sapiens (Human))
Hutchison Medipharma
US Patent
LigandPNGBDBM228759(US9346810, 208)
Affinity DataIC50:  0.0550nMT: 2°C. Assay description: JAK1/2/3 kinase assay are performed in vitro using Kit-Tyr 6 Peptide (Invitrogen, Cat. No. PV4122). TYK2 kinase assay are performed in vitro using Z'...
Ligand InfoPC cidPC sid
In DepthDetails US Patent