BDBM228760 US9346810, 209
SMILES COC[C@@H](NC(=O)c1cc(F)c(N(C)[C@@H]2CCN(C2)c2ncnc3[nH]ccc23)c(F)c1)c1ccccc1
InChI Key InChIKey=QXVLADQSKJNARQ-AUSIDOKSSA-N
Data  2 IC50
  Tab Delimited (TSV)   2D SDfile   Computed 3D by Vconf -m prep SDfile
Find this compound or compounds like it in BindingDB:
Activity Spreadsheet -- Enzyme Inhibition Constant Data from BindingDB
Found 2 hits for monomerid = 228760
TargetTyrosine-protein kinase JAK3 [781-1124](Homo sapiens (Human))
Hutchison Medipharma
US Patent
LigandPNGBDBM228760(US9346810, 209)
Affinity DataIC50:  0.0550nMT: 2°C. Assay description: JAK1/2/3 kinase assay are performed in vitro using Kit-Tyr 6 Peptide (Invitrogen, Cat. No. PV4122). TYK2 kinase assay are performed in vitro using Z'...
Ligand InfoPC cidPC sid
In DepthDetails US Patent
TargetTyrosine-protein kinase JAK2 [808-1132](Homo sapiens (Human))
Hutchison Medipharma
US Patent
LigandPNGBDBM228760(US9346810, 209)
Affinity DataIC50:  0.0550nMT: 2°C. Assay description: JAK1/2/3 kinase assay are performed in vitro using Kit-Tyr 6 Peptide (Invitrogen, Cat. No. PV4122). TYK2 kinase assay are performed in vitro using Z'...
Ligand InfoPC cidPC sid
In DepthDetails US Patent