BDBM229238 US9328099, 30-67
SMILES NC(=O)c1cn(nc1Nc1ccccc1)C1(CC#N)CN(C1)C(=O)OCCc1ccccn1
InChI Key InChIKey=WEHGSQQTGDJRGL-UHFFFAOYSA-N
Data  2 IC50
  Tab Delimited (TSV)   2D SDfile   Computed 3D by Vconf -m prep SDfile
Find this compound or compounds like it in BindingDB:
Activity Spreadsheet -- Enzyme Inhibition Constant Data from BindingDB
Found 2 hits for monomerid = 229238
TargetTyrosine-protein kinase JAK1(Homo sapiens (Human))
Merck Sharp & Dohme
US Patent
LigandPNGBDBM229238(US9328099, 30-67)
Affinity DataIC50:  108nMT: 2°C. Assay description: The reactions employed a common peptide substrate, LCB-EQEDEPEGDYFEWLW-NH2 (in-house). The basic assay protocol is as follows: First, 250 nL of dilut...
Ligand InfoPC cidPC sid
In DepthDetails US Patent
TargetTyrosine-protein kinase JAK2(Homo sapiens (Human))
Merck Sharp & Dohme
US Patent
LigandPNGBDBM229238(US9328099, 30-67)
Affinity DataIC50:  849nMT: 2°C. Assay description: The reactions employed a common peptide substrate, LCB-EQEDEPEGDYFEWLW-NH2 (in-house). The basic assay protocol is as follows: First, 250 nL of dilut...
Ligand InfoPC cidPC sid
In DepthDetails US Patent