BDBM22949 1-[(3R,4S)-1-(2,3-dichlorophenyl)-4-hydroxypentan-3-yl]-1H-imidazole-4-carboxamide::CHEMBL328139::imidazole-4-carboxamide analogue, 6
SMILES C[C@H](O)[C@@H](CCc1cccc(Cl)c1Cl)n1cnc(c1)C(N)=O
InChI Key InChIKey=HCJYSIGJDKNVRU-TVQRCGJNSA-N
Data  1 KI  1 IC50
PDB links: 1 PDB ID matches this monomer.
  Tab Delimited (TSV)   2D SDfile   Computed 3D by Vconf -m prep SDfile
Find this compound or compounds like it in BindingDB:
Activity Spreadsheet -- Enzyme Inhibition Constant Data from BindingDB
Found 2 hits for monomerid = 22949
TargetAdenosine deaminase(Homo sapiens (Human))
Fujisawa Pharmaceutical
LigandPNGBDBM22949(1-[(3R,4S)-1-(2,3-dichlorophenyl)-4-hydroxypentan-...)
Affinity DataKi:  13nM ΔG°:  -10.6kcal/molepH: 7.4 T: 2°C. Assay description: The reaction velocity was measured by change in absorbance at 265nm (A265) resulting from the deamination of adenosine. The reaction was started by a...
TargetAdenosine deaminase(Homo sapiens (Human))
Fujisawa Pharmaceutical
LigandPNGBDBM22949(1-[(3R,4S)-1-(2,3-dichlorophenyl)-4-hydroxypentan-...)
Affinity DataIC50:  15nM. Assay description: Inhibitory concentration against adenosine deaminase