BDBM230356 US9340507, 22
SMILES Cc1c(-c2cccc(c2)C(F)(F)F)c(=O)c(cn1C1CCOC1)C(=O)NCc1ccc(cn1)S(C)(=O)=O
InChI Key InChIKey=KPPZFRIFVXJLGQ-UHFFFAOYSA-N
Data  1 IC50
  Tab Delimited (TSV)   2D SDfile   Computed 3D by Vconf -m prep SDfile
Find this compound or compounds like it in BindingDB:
Activity Spreadsheet -- Enzyme Inhibition Constant Data from BindingDB
Found 1 hit for monomerid = 230356
TargetNeutrophil elastase(Homo sapiens (Human))
Boehringer Ingelheim International
US Patent
LigandPNGBDBM230356(US9340507, 22)
Affinity DataIC50:  27nMpH: 7.5 T: 2°C. Assay description: Compound buffer: 100 mM Tris, 500 mM NaCl, adjusted to pH 7.5; Assay buffer: 100 mM Tris, 500 mM NaCl, adjusted to pH 7.5, containing 0.01% BSA. Test...
Ligand InfoPC cidPC sid
In DepthDetails US Patent