BDBM230398 US9340510, 1.002
SMILES COC(=O)c1ccc2CN(Cc3ccc(cc3)C(C)NC(C)=O)CCc2c1
InChI Key InChIKey=QEUWJQXZXZICOI-UHFFFAOYSA-N
Data  1 IC50
  Tab Delimited (TSV)   2D SDfile   Computed 3D by Vconf -m prep SDfile
Find this compound or compounds like it in BindingDB:
Activity Spreadsheet -- Enzyme Inhibition Constant Data from BindingDB
Found 1 hit for monomerid = 230398
TargetAcetyl-CoA carboxylase 2(Homo sapiens (Human))
Boehringer Ingelheim International
US Patent
LigandPNGBDBM230398(US9340510, 1.002)
Affinity DataIC50:  524nMpH: 7.5Assay Description:Assay reactions are then carried out in 384-well plates, with hACC2 in an appropriate dilution and at final assay concentrations (f.c.) of 100 mM Tri...
Ligand InfoPC cidPC sid
In DepthDetails US Patent