BDBM230861 US9346793, 12
SMILES Cc1nc(C(=O)Nc2cnn(Cc3nc(co3)C(C)(C)O)n2)c(o1)-c1cccc(OC(F)(F)F)c1
InChI Key InChIKey=MKSLTSYWCGRBHR-UHFFFAOYSA-N
Data  1 EC50
  Tab Delimited (TSV)   2D SDfile   Computed 3D by Vconf -m prep SDfile
Find this compound or compounds like it in BindingDB:
Activity Spreadsheet -- Enzyme Inhibition Constant Data from BindingDB
Found 1 hit for monomerid = 230861
TargetGuanine nucleotide-binding protein subunit alpha-15 [Y147C]/N-formyl peptide receptor 2(Homo sapiens (Human))
Actelion Pharmaceuticals
US Patent
LigandPNGBDBM230861(US9346793, 12)
Affinity DataEC50:  32.3nM. Assay description: Cells expressing recombinant human ALX receptor and the G-protein Gα16 (HEK293-hALXR-Gα16) were grown to 80% confluency in Growing Medium (...
Ligand InfoPC cidPC sid
In DepthDetails US Patent