BDBM230873 US9346797, 9
SMILES COc1cnc(nc1)C(=O)Oc1ccc(F)c(c1)[C@]1(N=C(N)CCC1(F)F)C(F)F
InChI Key InChIKey=SFPBLJAFFYMDGW-SFHVURJKSA-N
Data  1 KI
  Tab Delimited (TSV)   2D SDfile   Computed 3D by Vconf -m prep SDfile
Find this compound or compounds like it in BindingDB:
Activity Spreadsheet -- Enzyme Inhibition Constant Data from BindingDB
Found 1 hit for monomerid = 230873
TargetBeta-secretase 1(Homo sapiens (Human))
H. Lundbeck
US Patent
LigandPNGBDBM230873(US9346797, 9)
Affinity DataKi:  6.90nM ΔG°:  -11.1kcal/molepH: 4.5 T: 2°C. Assay description: The binding assay was performed as SPA-based assay using a biotinylated form of human BACE1 recombinantly expressed and subsequently purified from Fr...
Ligand InfoPC cidPC sid
In DepthDetails US Patent