BDBM231343 US9346798, 90
SMILES FC(F)(F)c1ccc(N2CCOc3cc(ccc23)S(=O)(=O)Nc2ncco2)c(c1)C#N
InChI Key InChIKey=YPYJOKUOZJDCBF-UHFFFAOYSA-N
Data  4 IC50
  Tab Delimited (TSV)   2D SDfile   Computed 3D by Vconf -m prep SDfile
Find this compound or compounds like it in BindingDB:
Activity Spreadsheet -- Enzyme Inhibition Constant Data from BindingDB
Found 4 hits for monomerid = 231343
TargetSodium channel protein type 5 subunit alpha(Homo sapiens (Human))
Amgen
US Patent
LigandPNGBDBM231343(US9346798, 90)
Affinity DataIC50: >1.00E+4nM. Assay description: HEK 293 cells stably transfected with either Nav 1.7 or with Nav 1.5 were recorded in population patch-clamp mode with the IonWorks® Quattro auto...
Ligand InfoPC cidPC sid
In DepthDetails US Patent
TargetSodium channel protein type 9 subunit alpha(Homo sapiens (Human))
Amgen
Curated by ChEMBL
LigandPNGBDBM231343(US9346798, 90)
Affinity DataIC50:  2.60E+3nM. Assay description: Inhibition of human NaV1.7 expressed in HEK293 cells at holding potential of -125 mV with test potentials to -10 mV by whole cell voltage clamp metho...
Ligand InfoPC cidPC sid
In DepthDetails ArticlePubMed
TargetSodium channel protein type 9 subunit alpha(Homo sapiens (Human))
Amgen
Curated by ChEMBL
LigandPNGBDBM231343(US9346798, 90)
Affinity DataIC50:  2.59E+3nM. Assay description: HEK 293 cells stably transfected with human Nav1.7 were recorded in whole cell voltage clamp mode with the PatchXpress automated electrophysiology sy...
Ligand InfoPC cidPC sid
In DepthDetails US Patent
TargetSodium channel protein type 9 subunit alpha(Homo sapiens (Human))
Amgen
Curated by ChEMBL
LigandPNGBDBM231343(US9346798, 90)
Affinity DataIC50:  924nM. Assay description: HEK 293 cells stably transfected with either Nav 1.7 or with Nav 1.5 were recorded in population patch-clamp mode with the IonWorks® Quattro auto...
Ligand InfoPC cidPC sid
In DepthDetails US Patent